{"text_format":"1","workbook":"xlsx","n_sheets":15,"sheets":["Návod","VŠ","VOŠ","ZOZ-Vyhlasky","Seznamy","414VS-SPaSSL","414VS-SPOD","414VS-VO","304-12VS-SPaSSL","414VOS-SPaSSL","414VOS-SPOD","414VOS-VO","DataCheck","Scénáře","MyNotes"],"not_rendered":{"charts":0,"images":1,"macros":1,"external_links":0,"defined_names":28,"comments":0,"pivot_tables":0},"unopened":[],"bounds":{"document_bytes":16777216,"sheet_cells":100000,"rows_first":2000,"rows_last":500,"rows_between":2000,"halvings":0,"cell_chars":16384,"cell_head_chars":4096},"cells_cut":0,"cells_raw":0,"read":"whole","date_system":"1900"}

{"sheet":"Návod","index":0,"n_rows":36,"n_cols":16,"rows_kept":36,"cut":false,"hidden":false,"merged":[[1,12,1,15]]}
[]
[null,null,null,null,null,null,null,null,null,null,null,null,"Kompatibilita: Excel 2021+, Office365"]
[null,null,null,null,null,null,null,null,null,null,null,null,"Verze: 31.3.2026"]
[]
[]
[null,"Vítejte, uživatelky a uživatelé pomůcky pro posuzování rovnocennosti ZOZ. Než se pustíte do práce, věnujte, prosím, pozornost následujícím informacím:"]
[]
[null,"1. Pokud vás aplikace vyzve, klikněte na Povolit obsah a potvrďte, že je dokument důvěryhodný."]
[null,"2. Pokud aplikace zobrazí červený pruh s bezpečnostním upozorněním Microsoft, označte dokument za důvěryhodný. Jak na to, zjistíte",null,null,null,null,null,null,null,null,null,null,null,null,"ZDE."]
[null,"     Pozor, bez těchto dvou kroků nebude pomůcka fungovat správně a je třeba ukončit její používání."]
[null,"3. Vyberte list podle toho, zda uchazeč/ka absolvoval/a vysokou (VŠ) nebo vyšší odbornou školu (VOŠ)."]
[null,"4. Následně začněte výběrem ZOZ, pro kterou chcete posouzení provést (lze vybrat pouze jednu možnost)."]
[null,"5. Vyplňujte požadované hodnoty do polí v řádcích, které se automaticky zvýrazňují na základě vkládaných dat."]
[null,"6. V průběhu zadávání potřebných údajů se v řádcích pro výsledek zobrazuje ikona vykřičníku (",null,null,null,null,null,null,null,0,")"]
[null,"7. Po vyplnění všech požadovaných hodnot se zobrazí výsledek podle příslušné vyhlášky (",null,null,null,null,null,null,"buď ",-1,", nebo",1,") se slovním vyjádřením (Splňuje/te nebo Nesplňuje/te)."]
{"$rows_left_out":22}
{"sheet":"VŠ","index":1,"n_rows":14,"n_cols":8,"rows_kept":14,"cut":false,"hidden":false,"merged":[[0,0,0,4],[1,0,1,4],[3,3,3,4],[11,3,12,4]]}
["Pomůcka pro určování rovnocennosti vzdělání sociálních pracovníků a veřejných opatrovníků\npodle vyhlášek č. 414/2024 Sb. a 304/2012 Sb."]
["VYSOKÉ ŠKOLY"]
[null,null,null,null,null,null,{"$f":"SUMPRODUCT(--(_xlfn.ANCHORARRAY($G$4)<>\"\"))>0","v":false},{"$f":"SUMPRODUCT(--(_xlfn.ANCHORARRAY($H$4)<>\"\"))>0","v":false}]
["Č.","Položka","Hodnota","Navigace",null,null,{"$f":"IFERROR(\nIF(AND($C$5=1,$C$6=1),_xlfn.LET(_xlpm.sez,_xlfn._xlws.SORT(_xlfn.UNIQUE(_xlfn._xlws.FILTER('414VS-SPaSSL'!$C:$C,('414VS-SPaSSL'!$A:$A=$C$7)*('414VS-SPaSSL'!$C:$C<>\"\")))),_xlfn.VSTACK(\"\",\"Bez specializace\",_xlfn._xlws.FILTER(_xlpm.sez,(_xlpm.sez<>\"\")*ISTEXT(_xlpm.sez)))),\nIF(AND($C$5=2,$C$6=1),_xlfn.LET(_xlpm.sez,_xlfn._xlws.SORT(_xlfn.UNIQUE(_xlfn._xlws.FILTER('414VS-SPOD'!$C:$C,('414VS-SPOD'!$A:$A=$C$7)*('414VS-SPOD'!$C:$C<>\"\")))),_xlfn.VSTACK(\"\",\"Bez specializace\",_xlfn._xlws.FILTER(_xlpm.sez,(_xlpm.sez<>\"\")*ISTEXT(_xlpm.sez)))),\nIF(AND($C$5=3,$C$6=1),_xlfn.LET(_xlpm.sez,_xlfn._xlws.SORT(_xlfn.UNIQUE(_xlfn._xlws.FILTER('414VS-VO'!$C:$C,('414VS-VO'!$A:$A=$C$7)*('414VS-VO'!$C:$C<>\"\")))),_xlfn.VSTACK(\"\",\"Bez specializace\",_xlfn._xlws.FILTER(_xlpm.sez,(_xlpm.sez<>\"\")*ISTEXT(_xlpm.sez)))),\nIF(AND($C$5=1,$C$6=2,LEN($C$7)=5),_xlfn.LET(_xlpm.sez,_xlfn._xlws.SORT(_xlfn.UNIQUE(_xlfn._xlws.FILTER('304-12VS-SPaSSL'!$C:$C,('304-12VS-SPaSSL'!$A:$A=VŠ!$C$7)*(IFERROR(SEARCH(\"v sociálních službách\",'304-12VS-SPaSSL'!$D:$D),0)>0),\"\"))),_xlfn.VSTACK(\"\",_xlfn._xlws.FILTER(_xlpm.sez,(_xlpm.sez<>\"\")*ISTEXT(_xlpm.sez)))),\"\")))),\"\")","v":""},{"$f":"IFERROR(IF(AND($C$5=3,$C$6=1),_xlfn._xlws.SORT(_xlfn.UNIQUE(_xlfn._xlws.FILTER('414VS-VO'!$D:$D,('414VS-VO'!$A:$A=$C$7)*('414VS-VO'!$D:$D<>\"\")))),\"\"),\"\")","v":""}]
[1,"Vyberte ZOZ pro posouzení"]
[2,"Je na diplomu uveden kód studijního programu ve formátu A####A###### (např. B0923P240001)?"]
[3,{"$f":"IF(AND($C$5>0,$C$6=0),\"Zapište jej do vyznačeného pole\",IF(OR($C$5=0,$C$6=1),\"Zapište jej do vyznačeného pole\",\"Opište kód studijního programu z diplomu (např. B6731)\"))","v":"Zapište jej do vyznačeného pole"}]
[4,{"$f":"IF(OR($C$5=0,$C$6=0),\"Název studijního programu podle vyhlášky č. ?\",IF($C$6=1,\"Název studijního programu podle vyhlášky č. 414/2024 Sb.\",\"Název studijního programu podle vyhlášky č. 304/2012 Sb.\"))","v":"Název studijního programu podle vyhlášky č. ?"},{"$f":"IFERROR(IF(OR($C$5=0,$C$6=0,ISBLANK($C$7)),\"\",IF(AND($C$5=1,LEN($C$7)=12),VLOOKUP($C$7,'414VS-SPaSSL'!$A:$B,2,FALSE),\nIF(AND($C$5=2,LEN($C$7)=12),VLOOKUP($C$7,'414VS-SPOD'!$A:$B,2,FALSE),\nIF(AND($C$5=3,LEN($C$7)=12),VLOOKUP($C$7,'414VS-VO'!$A:$B,2,FALSE),\nIF(LEN($C$7)=5,VLOOKUP($C$7,'304-12VS-SPaSSL'!$A:$B,2,FALSE)))))),\"Není ve vyhlášce\")","v":""}]
[5,{"$f":"IF($C$6=1,\"Vyberte specializaci\",\"Vyberte studijní obor\")","v":"Vyberte studijní obor"}]
[6,{"$f":"IF(COUNTIFS($H$4,\"NEPRAVDA\"),CONCATENATE(\"Jsou absolvovány tyto předměty\",\": \",\" ?\"),IF(COUNTIFS($H$3,\"PRAVDA\"),CONCATENATE(\"Jsou absolvovány tyto předměty\",\": \",CHAR(10),\n$H$4,\" ?\"),CONCATENATE(\"Jsou absolvovány tyto předměty\",\": \",\" ?\")))","v":"Jsou absolvovány tyto předměty:  ?"}]
[7,"Uveďte rok zahájení studia"]
["9a","Výsledek podle vyhlášky č. 414/2024 Sb.",{"$f":"IF($C$5=0,\"\",\nIF(AND($C$5>0,$C$6=2),-1,\nIF($C$8=\"Není ve vyhlášce\",-1,\nIF(AND($C$5=1,$C$6=1,ISTEXT($C$7),COUNTIFS($C$9,\"Bez specializace\",$G$3,\"PRAVDA\"),COUNTIFS('414VS-SPaSSL'!A:A,VŠ!$C$7,'414VS-SPaSSL'!E:E,\"<=od \"&VŠ!$C$11)),1,\nIF(AND($C$5=1,$C$6=1,ISTEXT($C$7),COUNTIFS($G$3,\"NEPRAVDA\"),COUNTIFS('414VS-SPaSSL'!A:A,VŠ!$C$7,'414VS-SPaSSL'!E:E,\"<=od \"&VŠ!$C$11)),1,\nIF(AND($C$5=1,$C$6=1,ISTEXT($C$7),COUNTIFS('414VS-SPaSSL'!A:A,VŠ!$C$7,'414VS-SPaSSL'!C:C,$C$9,'414VS-SPaSSL'!E:E,\"<=od \"&VŠ!$C$11)),1,\nIF(AND($C$5=2,$C$6=1,ISTEXT($C$7),COUNTIFS($C$9,\"Bez specializace\",$G$3,\"PRAVDA\"),COUNTIFS('414VS-SPOD'!A:A,VŠ!$C$7,'414VS-SPOD'!E:E,\"<=od \"&VŠ!$C$11)),1,\nIF(AND($C$5=2,$C$6=1,ISTEXT($C$7),COUNTIFS($G$3,\"NEPRAVDA\"),COUNTIFS('414VS-SPOD'!A:A,VŠ!$C$7,'414VS-SPOD'!E:E,\"<=od \"&VŠ!$C$11)),1,\nIF(AND($C$5=2,$C$6=1,ISTEXT($C$7),COUNTIFS('414VS-SPOD'!A:A,VŠ!$C$7,'414VS-SPOD'!C:C,$C$9,'414VS-SPOD'!E:E,\"<=od \"&VŠ!$C$11)),1,\nIF(AND($C$5=3,$C$6=1,ISTEXT($C$7),$C$10=2,COUNTIFS($H$3,\"PRAVDA\")),-1,\nIF(AND($C$5=3,$C$6=1,ISTEXT($C$7),$C$10=1,COUNTIFS($H$3,\"PRAVDA\"),COUNTIFS('414VS-VO'!A:A,VŠ!$C$7,'414VS-VO'!E:E,\"<=od \"&VŠ!$C$11)),1,\nIF(AND($C$5=3,$C$6=1,ISTEXT($C$7),COUNTIFS($C$9,\"Bez specializace\",$G$3,\"PRAVDA\"),COUNTIFS('414VS-VO'!A:A,VŠ!$C$7,'414VS-VO'!E:E,\"<=od \"&VŠ!$C$11)),1,\nIF(AND($C$5=3,$C$6=1,ISTEXT($C$7),COUNTIFS($G$3,\"NEPRAVDA\"),COUNTIFS('414VS-VO'!A:A,VŠ!$C$7,'414VS-VO'!E:E,\"<=od \"&VŠ!$C$11)),1,\nIF(AND($C$5=3,$C$6=1,ISTEXT($C$7),COUNTIFS('414VS-VO'!A:A,VŠ!$C$7,'414VS-VO'!C:C,$C$9,'414VS-VO'!E:E,\"<=od \"&VŠ!$C$11)),1,\nIF(AND($C$5>0,$C$6=1,ISTEXT($C$7),$C$10=1,COUNTIFS($G$3,\"PRAVDA\"),OR(ISBLANK($C$8),ISBLANK($C$9),ISBLANK($C$11))),0,\nIF(AND($C$5>0,OR($C$6=0,ISBLANK($C$7),ISBLANK($C$8),ISBLANK($C$11))),0,\nIF(AND($C$5>0,LEN($C$7)=12,ISBLANK($C$9),ISTEXT($C$6),ISTEXT($C$7),ISTEXT($C$8),ISBLANK($C$11)),0,\nIF(AND($C$5>0,LEN($C$7)=12,OR(ISBLANK($C$6),ISBLANK($C$7),ISBLANK($C$11))),0,-1))))))))))))))))))","v":""},{"$f":"IF(OR($C$5=0,$C$12=0,$C$13=0),\"\",\nIF(OR($C$12=1,$C$13=1),\"Splňuje/te\",\"Nesplňuje/te\"))","v":""}]
["9b","Výsledek podle vyhlášky č. 304/2012 Sb.",{"$f":"IF($C$5=0,\"\",\nIF(AND($C$5>0,$C$6=1),-1,\nIF(AND($C$5>1,$C$6=2),-1,\nIF($C$8=\"Není ve vyhlášce\",-1,\nIF(AND($C$5=1,$C$6=2,ISTEXT($C$7),COUNTIFS($G$3,\"NEPRAVDA\"),$C$11>2024,COUNTIFS('304-12VS-SPaSSL'!$A:$A,VŠ!$C$7)),-1,\nIF(AND($C$5=1,$C$6=2,ISTEXT($C$7),$C$11>2024,COUNTIFS('304-12VS-SPaSSL'!$A:$A,VŠ!$C$7,'304-12VS-SPaSSL'!$B:$B,VŠ!$C$8,'304-12VS-SPaSSL'!$C:$C,VŠ!$C$9)),-1,\nIF(AND($C$5=1,$C$6=2,ISTEXT($C$7),COUNTIFS($G$3,\"NEPRAVDA\"),COUNTIFS('304-12VS-SPaSSL'!$A:$A,VŠ!$C$7,'304-12VS-SPaSSL'!$D:$D,\"v sociálních službách\")),1,\nIF(AND($C$5=1,$C$6=2,ISTEXT($C$7),ISNUMBER($C$11),$C$11<2025,COUNTIFS('304-12VS-SPaSSL'!$A:$A,VŠ!$C$7,'304-12VS-SPaSSL'!$B:$B,VŠ!$C$8,'304-12VS-SPaSSL'!$C:$C,VŠ!$C$9,'304-12VS-SPaSSL'!$D:$D,\"v sociálních službách\")),1,\nIF(AND($C$5>0,COUNTIFS($G$3,\"PRAVDA\"),OR(ISBLANK($C$6),ISBLANK($C$7),ISBLANK($C$11))),0,\nIF(AND($C$5>0,OR(ISBLANK($C$6),ISBLANK($C$7))),0,-1))))))))))","v":""}]
[null,"Ministerstvo práce a sociálních věcí©2026, Všechna práva vyhrazena; kontakt: PhDr. Filip Novotný, LL.M. (filip.novotny@mpsv.gov.cz)"]

{"sheet":"VOŠ","index":2,"n_rows":11,"n_cols":4,"rows_kept":11,"cut":false,"hidden":false,"merged":[[9,3,9,4],[0,0,0,4],[1,0,1,4],[3,3,3,4]]}
["Pomůcka pro určování rovnocennosti vzdělání sociálních pracovníků a veřejných opatrovníků\npodle vyhlášky č. 414/2024 Sb."]
["VYŠŠÍ ODBORNÉ ŠKOLY"]
[]
["Č.","Položka","Hodnota","Navigace"]
[1,"Vyberte ZOZ pro posouzení"]
[2,"Vyberte školu"]
[3,"Uveďte kód vzdělávacího programu (např. 75-32-N/01)"]
[4,"Název vzdělávacího programu podle vyhlášky č. 414/2024 Sb.",{"$f":"IFERROR(IF(ISBLANK($C$7),\"\",\nIF(AND($C$5=1,LEN($C$7)=10),VLOOKUP($C$7,'414VOS-SPOD'!$B:$D,2,FALSE),\nIF(AND($C$5=2,LEN($C$7)=10),VLOOKUP($C$7,'414VOS-SPOD'!$B:$D,2,FALSE),\nIF(AND($C$5=3,LEN($C$7)=10),VLOOKUP($C$7,'414VOS-VO'!$B:$D,2,FALSE))))),\"Tato kombinace není ve vyhlášce\")","v":""}]
[5,"Uveďte rok zahájení studia"]
[6,"Výsledek podle vyhlášky č. 414/2024 Sb.",{"$f":"IF($C$5=0,\"\",\nIF(AND($C$5>0,LEN($C$6)=0),0,\nIF(AND($C$5>0,OR(ISBLANK($C$6),ISBLANK($C$7),ISBLANK($C$9)),COUNTIFS($C$8,\"<>Tato kombinace není ve vyhlášce\")),0,\nIF(AND($C$5=1,COUNTIFS('414VOS-SPaSSL'!$A:$A,$C$6,'414VOS-SPaSSL'!$B:$B,$C$7,'414VOS-SPaSSL'!$D:$D,\"<=od \"&$C$9)>0),1,\nIF(AND($C$5=2,COUNTIFS('414VOS-SPOD'!$A:$A,$C$6,'414VOS-SPOD'!$B:$B,$C$7,'414VOS-SPOD'!$D:$D,\"<=od \"&$C$9)),1,\nIF(AND($C$5=3,COUNTIFS('414VOS-VO'!$A:$A,$C$6,'414VOS-VO'!$B:$B,$C$7,'414VOS-VO'!$D:$D,\"<=od \"&$C$9)),1,-1))))))","v":""},{"$f":"IF($C$10=1,\"Splňuje\",\nIF(OR($C$10=0,$C$5=0),\"\",\"Nesplňuje\"))","v":""}]
[null,"Ministerstvo práce a sociálních věcí©2026, Všechna práva vyhrazena; kontakt: PhDr. Filip Novotný, LL.M. (filip.novotny@mpsv.gov.cz)"]

{"sheet":"ZOZ-Vyhlasky","index":3,"n_rows":7,"n_cols":4,"rows_kept":7,"cut":false,"hidden":false,"merged":[[5,1,5,3],[6,1,6,3]]}
["ZOZ","Vyhláška 414/2024 Sb.","Vyhláška 304/2012 Sb.","Vyhláška 511/2002 Sb."]
["Sociální práce a sociální služby",1,1,-1]
["Sociálně-právní ochrana dětí",1,-1,-1]
["Veřejné opatrovnictví",1,-1,-1]
[]
[1,"Uplatní se, tato ZOZ je obsažena v příslušné vyhlášce"]
[-1,"Neuplatní se, tato ZOZ není obsažena v příslušné vyhlášce"]

{"sheet":"Seznamy","index":4,"n_rows":2,"n_cols":1,"rows_kept":2,"cut":false,"hidden":true,"merged":[]}
["VOŠ"]
[{"$f":"IF(VOŠ!$C$5=1,_xlfn.VSTACK(\"\",_xlfn._xlws.SORT(_xlfn.UNIQUE(TEXT(IFERROR(_xlfn._xlws.FILTER('414VOS-SPaSSL'!$A$3:$A$100, '414VOS-SPaSSL'!$A$3:$A$100<>0),\"\"),\"@\")),1,1)),\nIF(VOŠ!$C$5=2,_xlfn.VSTACK(\"\",_xlfn._xlws.SORT(_xlfn.UNIQUE(TEXT(IFERROR(_xlfn._xlws.FILTER('414VOS-SPOD'!$A$3:$A$100, '414VOS-SPOD'!$A$3:$A$100<>0),\"\"),\"@\")),1,1)),\nIF(VOŠ!$C$5=3,_xlfn.VSTACK(\"\",_xlfn._xlws.SORT(_xlfn.UNIQUE(TEXT(IFERROR(_xlfn._xlws.FILTER('414VOS-VO'!$A$3:$A$100, '414VOS-VO'!$A$3:$A$100<>0),\"\"),\"@\")),1,1)),\"\")))","v":""}]

{"sheet":"414VS-SPaSSL","index":5,"n_rows":37,"n_cols":5,"rows_kept":37,"cut":false,"hidden":true,"merged":[]}
["Column1","Column2","Column3","Column4","Column5"]
["Kód studijního programu","Název studijního programu","Specializace","Absolvované předměty","Rok zahájení studia"]
["B0923A240001","Sociální a charitativní práce","","","od 2018"]
["B0923A240003","Sociální práce","","","od 2019"]
["N0923A240003","Sociální práce","","","od 2019"]
["B0923P240007","Sociální práce","","","od 2020"]
["B0988P240002","Zdravotně sociální péče","","","od 2020"]
["B0988P240001","Zdravotně-sociální péče","","","od 2018"]
["B0923A240005","Sociální práce","","","od 2019"]
["N0923A240005","Sociální práce","Sociální práce s rodinou","","od 2019"]
["N0923A240005","Sociální práce","Rozvoj a řízení v sociální práci","","od 2019"]
["N0923A240005","Sociální práce","Sociální práce a kriminologie","","od 2020"]
["N0923A240007","Sociální práce a sociální podnikání","","","od 2021"]
["B0923P240002","Sociální práce","","","od 2018"]
["B0923P240003","Zdravotně-sociální péče","","","od 2018"]
{"$rows_left_out":23}
{"sheet":"414VS-SPOD","index":6,"n_rows":38,"n_cols":5,"rows_kept":38,"cut":false,"hidden":true,"merged":[]}
["Column1","Column2","Column3","Column4","Column5"]
["Kód studijního programu","Název studijního programu","Specializace","Absolvované předměty","Rok zahájení studia"]
["B0923A240001","Sociální a charitativní práce","","","od 2018"]
["B0923A240003","Sociální práce","","","od 2019"]
["N0923A240003","Sociální práce","","","od 2019"]
["B0923P240007","Sociální práce","","","od 2020"]
["B0988P240002","Zdravotně sociální péče","","","od 2020"]
["B0988P240001","Zdravotně-sociální péče","","","od 2018"]
["B0923A240005","Sociální práce","","","od 2019"]
["N0923A240005","Sociální práce","Sociální práce s rodinou","","od 2019"]
["N0923A240005","Sociální práce","Rozvoj a řízení v sociální práci","","od 2019"]
["N0923A240005","Sociální práce","Sociální práce a kriminologie","","od 2020"]
["N0923A240007","Sociální práce a sociální podnikání","","","od 2021"]
["B0923P240002","Sociální práce","","","od 2018"]
["B0923P240003","Zdravotně-sociální péče","","","od 2018"]
{"$rows_left_out":24}
{"sheet":"414VS-VO","index":7,"n_rows":40,"n_cols":5,"rows_kept":40,"cut":false,"hidden":true,"merged":[]}
["Column1","Column2","Column3","Column4","Column5"]
["Kód studijního programu","Název studijního programu","Specializace","Absolvované předměty","Rok zahájení studia"]
["B0923P240001","Sociální práce","","","od 2018"]
["B0923P240002","Sociální práce","","","od 2018"]
["B0923P240003","Zdravotně-sociální péče","","","od 2018"]
["N0988A240003","Management sociální práce v organizacích","","","od 2018"]
["B0988P240004","Zdravotně sociální péče","Zdravotně sociální pracovník","","od 2022"]
["B0923P240004","Sociální a pastorační práce","","","od 2024"]
["B0923P240012","Sociální a charitativní práce","","","od 2022"]
["N0923A240004","Etika v sociální práci","","","od 2020"]
["B0923A240002","Sociální práce","","","od 2019"]
["N0923A240002","Sociální práce","","","od 2019"]
["B0923P240007","Sociální práce","","","od 2020"]
["B0988P240002","Zdravotně sociální péče","","","od 2020"]
["B0988P240001","Zdravotně-sociální péče","","","od 2018"]
{"$rows_left_out":26}
{"sheet":"304-12VS-SPaSSL","index":8,"n_rows":90,"n_cols":4,"rows_kept":90,"cut":false,"hidden":true,"merged":[]}
["Column1","Column2","Column3","Column4"]
["2. pro zvláštní část","2. pro zvláštní část","2. pro zvláštní část","2. pro zvláštní část"]
["Kód studijního programu","Studijní program","Obor","Správní činnosti"]
["M6805","Právo a právní věda","Právo","při přestupkovém řízení ve věci pořádku ve státní správě, pořádku v územní samosprávě, veřejného pořádku, občanského soužití a majetku"]
["B6202","Hospodářská politika a správa","Finanční kontrola","při finančním hospodaření územních samosprávných celků a jeho přezkumu"]
["B6202","Hospodářská politika a správa","Veřejné finance"]
["B6202","Hospodářská politika a správa","Evropská hospodářská, správní a kulturní studia"]
["B6202","Hospodářská politika a správa","Veřejná ekonomika a správa"]
["B6202","Hospodářská politika a správa","Hospodářská politika"]
["B6208","Ekonomika a management","Účetnictví a finanční řízení podniku"]
["N6208","Ekonomika a management","Účetnictví a finanční řízení podniku"]
["B6217","Finance a účetnictví","Finance a právo"]
["B6804","Právní specializace","Právo a finance"]
["B6804","Právní specializace","Veřejná správa"]
["B6807","Veřejná správa","Veřejná správa"]
{"$rows_left_out":76}
{"sheet":"414VOS-SPaSSL","index":9,"n_rows":19,"n_cols":4,"rows_kept":19,"cut":false,"hidden":true,"merged":[]}
["Column1","Column2","Column3","Column4"]
["Název školy","Kód vzdělávacího programu","Název vzdělávacího programu","Rok zahájení studia"]
["Střední průmyslová škola elektrotechnická a Vyšší odborná škola Pardubice","75-32-N/01","Sociální práce","od 2020"]
["Obchodní akademie a vyšší odborná škola Brno, Kotlářská, příspěvková organizace","75-32-N/01","Sociální práce","od 2021"]
["CARITAS - Vyšší odborná škola sociální Olomouc","75-32-N/01","Sociální práce","od 2019"]
["CARITAS - Vyšší odborná škola sociální Olomouc","75-32-N/03","Sociální a humanitární práce","od 2019"]
["Obchodní akademie a Vyšší odborná škola sociálně právní, Ostrava, příspěvková organizace","75-32-N/01","Sociální práce","od 2016"]
["Obchodní akademie a Vyšší odborná škola sociálně právní, Ostrava, příspěvková organizace","75-32-N/06","Sociální pedagogika","od 2018"]
["Evangelická akademie, Vyšší odborná škola sociálně právní","75-32-N/05","Sociálně právní činnost","od 2021"]
["Střední zdravotnická škola a Vyšší odborná škola zdravotnická, Plzeň, Karlovarská 99","75-32-N/01","Sociální práce","od 2021"]
["JABOK - Vyšší odborná škola sociálně pedagogická a teologická","75-32-N/02","Sociální pedagogika a teologie","od 2024"]
["Evangelikální teologický seminář - Vyšší odborná škola teologická a sociální","75-32-N/07","Pastorační a sociální práce","od 2023"]
["Soukromá vyšší odborná škola sociální, o.p.s.","75-32-N/01","Sociální práce","od 2023"]
["Vyšší odborná škola pedagogická a sociální, Střední odborná škola pedagogická a Gymnázium, Praha 6, Evropská 33","75-32-N/06","Sociální pedagogika","od 2019"]
["Jahodovka - Vyšší odborná škola sociálně právní","75-32-N/01","Sociální práce","od 2014"]
{"$rows_left_out":5}
{"sheet":"414VOS-SPOD","index":10,"n_rows":19,"n_cols":4,"rows_kept":19,"cut":false,"hidden":true,"merged":[]}
["Column1","Column2","Column3","Column4"]
["Název školy","Kód vzdělávacího programu","Název vzdělávacího programu","Rok zahájení studia"]
["Střední průmyslová škola elektrotechnická a Vyšší odborná škola Pardubice","75-32-N/01","Sociální práce","od 2020"]
["Obchodní akademie a vyšší odborná škola Brno, Kotlářská, příspěvková organizace","75-32-N/01","Sociální práce","od 2021"]
["CARITAS - Vyšší odborná škola sociální Olomouc","75-32-N/01","Sociální práce","od 2019"]
["CARITAS - Vyšší odborná škola sociální Olomouc","75-32-N/03","Sociální a humanitární práce","od 2019"]
["Obchodní akademie a Vyšší odborná škola sociálně právní, Ostrava, příspěvková organizace","75-32-N/01","Sociální práce","od 2016"]
["Obchodní akademie a Vyšší odborná škola sociálně právní, Ostrava, příspěvková organizace","75-32-N/06","Sociální pedagogika","od 2018"]
["Evangelická akademie, Vyšší odborná škola sociálně právní","75-32-N/05","Sociálně právní činnost","od 2021"]
["Střední zdravotnická škola a Vyšší odborná škola zdravotnická, Plzeň, Karlovarská 99","75-32-N/01","Sociální práce","od 2021"]
["JABOK - Vyšší odborná škola sociálně pedagogická a teologická","75-32-N/02","Sociální pedagogika a teologie","od 2024"]
["Evangelikální teologický seminář - Vyšší odborná škola teologická a sociální","75-32-N/07","Pastorační a sociální práce","od 2023"]
["Soukromá vyšší odborná škola sociální, o.p.s.","75-32-N/01","Sociální práce","od 2023"]
["Vyšší odborná škola pedagogická a sociální, Střední odborná škola pedagogická a Gymnázium, Praha 6, Evropská 33","75-32-N/06","Sociální pedagogika","od 2019"]
["Jahodovka - Vyšší odborná škola sociálně právní","75-32-N/01","Sociální práce","od 2014"]
{"$rows_left_out":5}
{"sheet":"414VOS-VO","index":11,"n_rows":19,"n_cols":4,"rows_kept":19,"cut":false,"hidden":true,"merged":[]}
["Column1","Column2","Column3","Column4"]
["Název školy","Kód vzdělávacího programu","Název vzdělávacího programu","Rok zahájení studia"]
["Střední průmyslová škola elektrotechnická a Vyšší odborná škola Pardubice","75-32-N/01","Sociální práce","od 2020"]
["Obchodní akademie a vyšší odborná škola Brno, Kotlářská, příspěvková organizace","75-32-N/01","Sociální práce","od 2021"]
["CARITAS - Vyšší odborná škola sociální Olomouc","75-32-N/01","Sociální práce","od 2019"]
["CARITAS - Vyšší odborná škola sociální Olomouc","75-32-N/03","Sociální a humanitární práce","od 2019"]
["Obchodní akademie a Vyšší odborná škola sociálně právní, Ostrava, příspěvková organizace","75-32-N/01","Sociální práce","od 2016"]
["Obchodní akademie a Vyšší odborná škola sociálně právní, Ostrava, příspěvková organizace","75-32-N/06","Sociální pedagogika","od 2018"]
["Evangelická akademie, Vyšší odborná škola sociálně právní","75-32-N/05","Sociálně právní činnost","od 2021"]
["Střední zdravotnická škola a Vyšší odborná škola zdravotnická, Plzeň, Karlovarská 99","75-32-N/01","Sociální práce","od 2021"]
["JABOK - Vyšší odborná škola sociálně pedagogická a teologická","75-32-N/02","Sociální pedagogika a teologie","od 2024"]
["Evangelikální teologický seminář - Vyšší odborná škola teologická a sociální","75-32-N/07","Pastorační a sociální práce","od 2023"]
["Soukromá vyšší odborná škola sociální, o.p.s.","75-32-N/01","Sociální práce","od 2023"]
["Vyšší odborná škola pedagogická a sociální, Střední odborná škola pedagogická a Gymnázium, Praha 6, Evropská 33","75-32-N/06","Sociální pedagogika","od 2019"]
["Jahodovka - Vyšší odborná škola sociálně právní","75-32-N/01","Sociální práce","od 2014"]
{"$rows_left_out":5}
{"sheet":"DataCheck","index":12,"n_rows":2,"n_cols":3,"rows_kept":2,"cut":false,"hidden":true,"merged":[]}
["List","Souřadnice","Ověření"]
["VŠ","C7",{"$f":"OR(AND(VŠ!$C$6=1,\nLEN(VŠ!$C$7)=12,\nNOT(ISNUMBER(--MID(VŠ!$C$7,1,1))),\nISNUMBER(--MID(VŠ!$C$7,2,4)),\nNOT(ISNUMBER(--MID(VŠ!$C$7,6,1))),\nISNUMBER(--MID(VŠ!$C$7,7,2)),\nISNUMBER(--RIGHT(VŠ!$C$7,5))),\n\nAND(VŠ!$C$6=2,\nLEN(VŠ!$C$7)=5,\nNOT(ISNUMBER(--MID(VŠ!$C$7,1,1))),\nISNUMBER(--MID(VŠ!$C$7,2,4))))","v":false}]

{"sheet":"Scénáře","index":13,"n_rows":17,"n_cols":10,"rows_kept":17,"cut":false,"hidden":true,"merged":[]}
[null,"V1","V2","V3","V4","V5","V6","V7",null,"V8"]
[null,"414/2024","414/2024","414/2024","414/2024","414/2024","414/2024","414/2024",null,"304/2012"]
["C5","SPaSSL (1)","SPaSSL(1)","SPOD (2)","SPOD (2)","VO (3)","VO (3)","VO (3)",null,"SPaSSL (1)"]
["C6","Ano (1)","Ano (1)","Ano (1)","Ano (1)","Ano (1)","Ano (1)","Ano (1)",null,"Ne (2)"]
["C7","12 znaků","12 znaků","12 znaků","12 znaků","12 znaků","12 znaků","12 znaků",null,"5 znaků"]
["C8","StudProg","StudProg","StudProg","StudProg","StudProg","StudProg","StudProg",null,"StudProg"]
["C9",null,"Specializace",null,"Specializace",null,null,"Specializace",null,"StudObor"]
["C10",null,null,null,null,null,"Ano (1)"]
["C11","Rok>=vyhl.","Rok>=vyhl.","Rok>=vyhl.","Rok>=vyhl.","Rok>=vyhl.","Rok>=vyhl.","Rok>=vyhl.",null,"Rok<vyhl."]
["C12",null,null,null,null,null,null,null,null,"Ano (1)"]
["Výsledek",1,1,1,1,1,1,1,null,1]
[]
[null,null,"G3=PRAVDA",null,"G3=PRAVDA",null,"H3=PRAVDA","G3=PRAVDA",null,"G3=PRAVDA"]
[]
["Stav","OK","OK","OK","OK","OK","OK","OK",null,"OK"]
{"$rows_left_out":3}
{"sheet":"MyNotes","index":14,"n_rows":7,"n_cols":2,"rows_kept":7,"cut":false,"hidden":true,"merged":[]}
["KDYŽ($C$5=0;\"\";\nKDYŽ(A($C$5=1;$C$6=1;JE.TEXT($C$7);COUNTIFS('414VS-SPaSSL'!A:A;VŠ!$C$7;'414VS-SPaSSL'!C:C;$C$10;'414VS-SPaSSL'!E:E;\"od \"&VŠ!$C$8));1;\nKDYŽ(A($C$5=1;$C$6=1;JE.TEXT($C$7);COUNTIFS('414-VS-SPOD'!A:A;VŠ!$C$7;'414-VS-SPOD'!C:C;$C$10;'414-VS-SPOD'!E:E;\"od \"&VŠ!$C$8));1;\nKDYŽ(A($C$5=1;$C$6=1;JE.TEXT($C$7);COUNTIFS('414VS-SPaSSL'!A:A;VŠ!$C$7;'414VS-SPaSSL'!C:C;$C$10;'414VS-SPaSSL'!E:E;\"od \"&VŠ!$C$8));1;0))))"]
[]
["C7>= DATE(2020;1;1)"]
[]
[{"$f":"OR(AND($C$6=1,LEN(C7)=12,ISTEXT(MID(C7,1,1)),ISNUMBER(--MID(C7,2,4)),ISTEXT(MID(C7,6,1)),ISNUMBER(--RIGHT(C7,5))),\nAND($C$6=2,LEN(C7)=5,ISTEXT(MID(C7,1,1)),ISNUMBER(--MID(C7,2,4))),\nAND($C$6=2,LEN(C7)=6,ISNUMBER(--MID(C7,1,4)),MID(C7,5,1)=\" \"),ISTEXT(MID(C7,6,1)))","v":true},"Upravit ověřování dat v C7"]
[]
[{"$f":"OR(AND($C$6=1,LEN($C$9)=12,ISTEXT(MID($C$9,1,1)),ISNUMBER(--MID($C$9,2,4)),ISTEXT(MID($C$9,6,1)),ISNUMBER(--MID($C$9,7,2)),ISNUMBER(--RIGHT($C$9,5))),\nAND($C$6=2,LEN($C$9)=5,ISTEXT(MID($C$9,1,1)),ISNUMBER(--MID($C$9,2,4))),\nAND($C$6=2,LEN($C$9)=6,ISNUMBER(--MID($C$9,1,4)),MID($C$9,5,1)=\" \"),ISTEXT(MID($C$9,6,1)))","v":true}]